{"text_format":"1","workbook":"xlsx","n_sheets":7,"sheets":["Veil","Introduction","Comparison","Calculator","Printable","FieldFinder","Agreement"],"not_rendered":{"charts":0,"images":4,"macros":1,"external_links":2,"defined_names":14,"comments":4,"pivot_tables":0},"unopened":[],"bounds":{"document_bytes":16777216,"sheet_cells":100000,"rows_first":2000,"rows_last":500,"rows_between":2000,"halvings":0,"cell_chars":16384,"cell_head_chars":4096},"cells_cut":0,"cells_raw":0,"read":"whole","date_system":"1900"}

{"sheet":"Veil","index":0,"n_rows":23,"n_cols":3,"rows_kept":23,"cut":false,"hidden":false,"merged":[]}
[]
[]
[]
[null,null," Copy Protection Test in Progress"]
[]
[null,null,"This sheet should appear temporarily while your computer runs"]
[null,null,"a brief test of a third party copy protection system."]
[]
[]
[null,null,"If this sheet remains on your screen for more that a 30 seconds,"]
[null,null,"one of three known conditions likely exists."]
[]
[]
[null,null,"1. an internet connection is not available"]
[]
{"$rows_left_out":9}
{"sheet":"Introduction","index":1,"n_rows":40,"n_cols":5,"rows_kept":40,"cut":false,"hidden":true,"merged":[[32,1,33,5],[37,1,37,4],[4,3,4,4],[7,3,7,4],[27,2,27,3],[28,3,28,4],[11,3,11,4],[12,3,12,4],[25,3,25,4],[2,1,2,5],[21,3,21,4],[6,2,6,3],[24,2,24,3],[15,3,15,4],[16,3,16,4],[18,3,18,4],[19,3,19,4],[14,3,14,4],[9,3,9,4]]}
[]
[]
[null,"This tool is best used as an active spreadsheet using Microsoft Excel."]
[null,null,null,null,"Please read the attached \"Agreement\" before using this tool"]
[null,null,null,"To change from this introduction to any of the other 3 worksheet layers, click on the Tabs at the bottom of the screen (Comparison, Calculator, Footnotes).  Hints for using each are as follows:"]
[]
[null,null,"Comparison Tab"]
[null,null,null,"This comparison table has \"locked\" titles on both the top and left side.  This enables you to scroll throughout the spreadsheet without losing your reference titles."]
[]
[null,null,null,"Cells shaded like this one, indicate there are footnotes for this feature.  To automatically see the footnote on-screen, simply place your mouse pointer over that cell.  Try it here."]
[]
[null,null,null,"Products may be \"Filtered\" or short-listed to help you select the options that apply to your client."]
[null,null,null,"By criterion - to see the short list of the products that fit your clients: LTV, Beacon, income source, etc. simply click on the down arrow in the applicable title cell.  A drop down list of all the options  listed will appear.  Within that new drop-down list, click on the data that most closely fits your clients circumstances and a \"short-list\" of the matching lenders will be left for your review.  You can \"Filter\" on more than one title at a time.  For more details on using the the filter tool contact your RSM."]
[]
[null,null,null,"There seems to be: no industry standard on policies, and great inconsistency in terminology.  The definitions we have used here are:"]
{"$rows_left_out":26}
{"sheet":"Comparison","index":2,"n_rows":145,"n_cols":53,"rows_kept":145,"cut":false,"hidden":true,"merged":[[29,1,29,2],[8,1,8,2],[17,1,17,2],[18,1,18,2],[128,1,128,2],[124,1,124,2],[125,1,125,2],[126,1,126,2],[106,50,107,50],[127,1,127,2],[35,1,35,2],[36,1,36,2],[37,1,37,2],[38,1,38,2],[39,1,39,2],[24,1,24,2],[61,1,61,2],[62,1,62,2],[87,1,87,2],[79,1,79,2],[80,1,80,2],[114,1,114,2],[89,1,89,2],[90,1,90,2],[3,43,4,43],[3,38,4,38],[3,42,4,42],[3,31,4,31],[3,33,4,33],[3,30,4,30],[3,37,4,37],[9,1,9,2],[10,1,10,2],[7,1,7,2],[3,5,4,5],[3,6,4,6],[142,1,142,5],[3,7,4,7],[3,4,4,4],[53,1,53,2],[60,1,60,2],[45,1,45,2],[46,1,46,2],[47,1,47,2],[48,1,48,2],[49,1,49,2],[42,1,42,2],[26,1,26,2],[40,1,40,2],[43,1,43,2],[30,1,30,2],[31,1,31,2],[32,1,32,2],[33,1,33,2],[118,1,118,2],[97,1,97,2],[71,1,71,2],[72,1,72,2],[123,1,123,2],[137,1,137,9],[136,1,136,9],[3,13,4,13],[136,37,136,43],[3,14,3,15],[6,1,6,2],[3,29,4,29],[25,1,25,2],[51,1,51,2],[41,1,41,2],[14,1,14,2],[21,1,21,2],[81,1,81,2],[82,1,82,2],[3,16,3,17],[22,1,22,2],[13,1,13,2],[20,1,20,2],[70,1,70,2],[16,1,16,2],[84,1,84,2],[69,1,69,2],[92,1,92,2],[112,1,112,2],[113,1,113,2],[3,49,4,49],[1,4,1,9],[2,4,2,13],[63,1,63,2],[64,1,64,2],[65,1,65,2],[129,1,129,2],[1,10,1,52],[3,52,4,52],[2,25,2,33],[3,50,4,50],[3,25,4,25],[3,12,4,12],[2,14,2,24],[3,48,4,48],[2,34,2,36],[3,10,4,10],[121,1,121,2],[122,1,122,2],[86,1,86,2],[83,1,83,2],[94,1,94,2],[95,1,95,2],[96,1,96,2],[73,1,73,2],[74,1,74,2],[75,1,75,2],[85,1,85,2],[0,8,0,52],[3,27,4,27],[3,11,4,11],[3,46,4,46],[3,8,3,9],[2,37,2,52],[3,41,4,41],[3,47,4,47],[3,32,4,32],[3,26,4,26],[3,39,4,39],[3,45,4,45],[3,44,4,44],[3,18,3,20],[3,28,4,28],[3,21,3,22],[3,51,4,51],[3,40,4,40],[3,34,4,34],[3,23,4,23],[68,1,68,2],[117,1,117,2],[115,1,115,2],[116,1,116,2],[131,1,131,2],[1,1,4,2],[108,1,108,2],[109,1,109,2],[119,1,119,2],[120,1,120,2],[103,1,103,2],[104,1,104,2],[105,1,105,2],[106,1,106,2],[107,1,107,2],[98,1,98,2],[99,1,99,2],[100,1,100,2],[101,1,101,2],[102,1,102,2],[93,1,93,2],[50,1,50,2],[44,1,44,2],[15,1,15,2],[130,1,130,2],[11,1,11,2],[12,1,12,2],[54,1,54,2],[55,1,55,2],[56,1,56,2],[57,1,57,2],[58,1,58,2],[59,1,59,2],[76,1,76,2],[52,1,52,2],[23,1,23,2],[19,1,19,2],[34,1,34,2],[27,1,27,2],[28,1,28,2],[77,1,77,2],[78,1,78,2],[91,1,91,2],[110,1,110,2],[111,1,111,2],[88,1,88,2],[66,1,66,2],[67,1,67,2]]}
[null," "]
[null,"\"Building the best broker tools\nsince the fax machine\"\nnot updated past May 31 2018",null,null,"© printing or copying this page or any portion of this page, in any way, without prior written permission of the author is prohibited ",null,null,null,null,null,{"$f":"REPT(\"Niquie  by MORTGAGE MENTOR    : : :   \",24)","v":"Niquie  by MORTGAGE MENTOR    : : :   Niquie  by MORTGAGE MENTOR    : : :   Niquie  by MORTGAGE MENTOR    : : :   Niquie  by MORTGAGE MENTOR    : : :   Niquie  by MORTGAGE MENTOR    : : :   Niquie  by MORTGAGE MENTOR    : : :   Niquie  by MORTGAGE MENTOR    : : :   Niquie  by MORTGAGE MENTOR    : : :   Niquie  by MORTGAGE MENTOR    : : :   Niquie  by MORTGAGE MENTOR    : : :   Niquie  by MORTGAGE MENTOR    : : :   Niquie  by MORTGAGE MENTOR    : : :   Niquie  by MORTGAGE MENTOR    : : :   Niquie  by MORTGAGE MENTOR    : : :   Niquie  by MORTGAGE MENTOR    : : :   Niquie  by MORTGAGE MENTOR    : : :   Niquie  by MORTGAGE MENTOR    : : :   Niquie  by MORTGAGE MENTOR    : : :   Niquie  by MORTGAGE MENTOR    : : :   Niquie  by MORTGAGE MENTOR    : : :   Niquie  by MORTGAGE MENTOR    : : :   Niquie  by MORTGAGE MENTOR    : : :   Niquie  by MORTGAGE MENTOR    : : :   Niquie  by MORTGAGE MENTOR    : : :   "}]
[null,null,null,null,"PRODUCT SELECTION",null,null,null,null,null,null,null,null,null,"QUALIFYING",null,null,null,null,null,null,null,null,null,null,"INCOME",null,null,null,null,null,null,null,null,"PRODUCT OPTIONS",null,null,"MISCELLANEOUS"]
[null,null,null,null,"Lending Area","LTV (%) Maximum","Beacon Minimum","Credit","Loan Amount",null,"Equity Minimum","Seconds Allowed","Purpose","Property Type","Insurable",null,"Un-Insurable",null,"Amortization",null,null,"Qualifying Rate",null,"Deal Rate","Rate","Evidence of Income","Income Source","Other Documents Underwriter may ask for","NOA's\nre No tax","Time Self Employed","Max Time Self Employed","100% Commission","Salary plus Commission","Employed\nCo Borrower","Terms Available","Annual","Payment","Security","Application Fees","Appl. Fee added?","Mortgage Risk Insurance","Premium Added to Mort.","Client set-up costs","Appraisal","Title Insurance","New to Canada","Assumable","Portable"," Switch  \"in\"","Refinance","Product Advantage","Finders Fees","Volume Bonus"]
[null,null,null,null,null,null,null,null,"Minimum","Maximum",null,null,null,null,"GDS %","TDS %","GDS %","TDS %","Insurable","Un-Insurable","Minimum","Insurable","Un-Insurable",null,"Buy Down",null,null,null,null,null,null,null,null,null,null,"Prepayment","Increase"]
[null,"Column Finder - click here.",null,null,null,null,null,null,null,null,null,null,null,null,null,null,null,null,null,null,null,null,null,null,null,null,null,null,null,null,null,null,null,null,null,null,null,null,null,null,null,null,null,null,null,null,null,null,null,null,null," "]
["C.G.","Canada Guaranty\n                    ( Low Doc Advantage )",null,null,"National",90,"Strong","12 months \nNo Derog's","per Lender",750000,"10% incl Gift\n(min 5% own savings)","Case by case","Purch","O/O max 2 units, \nExisting & New Construction",39,44,"n/a","n/a",25,"n/a","per lender","higher of Deal Rate \nor 5yr Benchmark","n/a","per lender","per lender","Stated","BFS","Proof 2yrs BFS\n recent NOA","Current","Min. 2yr provable","No Max.","No","Not Eligible","Std. Underwriting","per Lender","n/a","n/a","1st Mort.","no","no","C.G. Low Doc Premium ","Client choice","n/a","Own","per Lender"," -","On Qual.","Several options","per Lender","Yes","Signed declaration of income acceptable\nSeveral portability options"," -","n/a"]
["C.G.","Canada Guaranty\n      ( BFS Down Payment Advantage )",null,null,"National",95,620,"12 months \nNo Derog's","per Lender","per Lender",0.05,"Case by case","Purch, Purch Plus Improv.","O/O max 4 units, \nExisting & New Construction","35/39","42/44","n/a","n/a",25,"n/a","per lender","higher of Deal Rate \nor 5yr Benchmark","n/a","per lender","per lender","Yes","BFS","per Lender","Current","Min. 2yr","No Max.","2 years","Yes\n 2yr average","Std. Underwriting","per Lender","n/a","n/a","1st Mort.","no","no","C.G. Standard Premium ","Client choice","n/a","Own","per Lender"," -","On Qual.","Yes","per Lender","Yes","per lender"," -","n/a"]
[null,"CMHC  ( Self-Employed )\n                        Traditional Validation",null,null,"National",95,600,"No Derog's","per Lender","per Lender","5% Traditional\n& Non-Traditional","to 95%","Purch, Purch Plus Improv.","O/O max 4 units, \n2-4 unit Small Rental","35/39","42/44","n/a","n/a",25,"n/a","per Lender","higher of Deal Rate \nor 5yr Benchmark","n/a","per lender","per lender","Yes \n15% Gross-up","BFS Documented","2 business related docs","Not Req'd","Min. 2yr same industry","No Max.","2 Years","2 years confirmation","Std. Underwriting","Fixed, ARM's & Capped VRM's","n/a","n/a","1st or 2nd Mort.","no","no","CMHC Standard Premium","Client choice","n/a","Yes","per Lender","Yes","On Qual.","Yes","per Lender","No","per lender"," -","n/a"]
["GNW","Genworth  ( ALT A - BFS )",null,null,"National",90,600,"Strong - 2 years","per Lender",750000,"10% incl Gift\n(min 5% own savings)","Genworth","Purch, Purch Plus Improv.","O/O max 2 units, \nExisting & New Construction",39,44,"n/a","n/a",25,"n/a","per Lender","higher of Deal Rate \nor 5yr Benchmark","n/a","per lender","per lender","Stated","BFS Documented","2 business related docs","Current","Min. 2yr","No Max.","No","Not Eligible","Std. Underwriting","Fixed, VRM, ARM, Capped VRM","n/a","n/a","1st or 2nd Mort.","no","no","Genworth ALT-A\n Premium","Client choice","n/a","Yes","per Lender","No","On Qual.","Several options","per Lender","No","note - ONLY one Genworth insured ALT-A mortgage"," -","n/a"]
["B2B Bank","B2B Bank           ( ALT-A BFS )",null,{"$f":"VLOOKUP(A11,'[1]My Six'!$F$5:$G$34,2,FALSE)","v":0},"National",90,600,"Strong - 2 years",50000,750000,"10% / 15%\n Gift allowed","to 90%","Purch, ReFi, ETO","O/O max 2 units",39,44,"35/39","42/44",25,"30 / 35","Term","higher of Deal Rate \nor 5yr Benchmark","n/a","Full Disc. Avail.","Yes","Verifiable or Reasonable","BFS Documented","Proof - in business\n and less than 3 years","Not Req'd","Min. 2yr same industry","No Max.","Yes","Yes","Std. Underwriting","VRM, Fixed 6 mo. to 10yr\n Open 6 mo./1yr, 6 mo. Convertible",15,15,"1st Mort.","no","no","Genworth \nover 65% LTV","Yes","n/a","Yes","Always","No"," -","Yes"," -","FCT Platinum","One Lender - MANY options","see rate sheet","n/a"]
["B2B Bank","B2B Bank   \n         ( BFS Bank Statement \"Expanded\" )",null,{"$f":"VLOOKUP(A12,'[1]My Six'!$F$5:$G$34,2,FALSE)","v":0},"National",80,580,"No Derog's",50000,1000000,"5% None Gifted","to 95%","Several","O/O max 2 units, Second Home\n Small Rental 2 units"," -"," -","35/39","42/44"," -",35,"Term"," -","higher of 5yr Benchmark or Deal Rate +2.00%","Full Disc. Avail.","Yes","Verifiable or Reasonable","BFS Documented","2 business related docs","Current","Min. 2yr","No Max.","2 Years","2 years confirmation","Std. Underwriting","Fixed 1yr to 10yr",15,15,"1st Mort.","no","no","CMHC Standard Premium","Yes","n/a","Yes","Always","No"," -","Yes"," -","FCT Platinum","Few lenders fill this niche","see rate sheet","n/a"]
["B2B Bank","B2B Bank         ( New Professional )",null,{"$f":"VLOOKUP(A13,'[1]My Six'!$F$5:$G$34,2,FALSE)","v":0},"National",80,580,"\"A -\"",50000,1000000,"10% None Gifted","to 90%","Purch, ReFi, ETO","O/O max 2 units, Second Home\n Small Rental 2 units"," -"," -","35/39","42/44"," -",35,"Term"," -","higher of 5yr Benchmark or Deal Rate +2.00%","Posted Plus","Yes","Verifiable or Reasonable","Professional Activities","2 business related docs","Current","Min. 2yr","No Max.","No","No","Same Underwriting","Fixed 6 mo. to 10yr\n Open 6 mo./1yr, 6 mo. Convertible",15,15,"1st Mort.","no","no","Title Insurance","no","n/a","Yes","Always","No","On Qual.","Yes"," -","FCT Platinum","Few lenders fill this niche","see rate sheet","Yes"]
["B2B Bank","B2B Bank        ( BFS Stated 2 years + )",null,{"$f":"VLOOKUP(A14,'[1]My Six'!$F$5:$G$34,2,FALSE)","v":0},"National",65,540,"\"A -\"",50000,750000,"10% None Gifted","to 90%","Purch, ReFi, ETO","O/O max 2 units, Second Home\n Small Rental 2 units"," -"," -",32,40," -","25 / 35","Term"," -","higher of 5yr Benchmark or Deal Rate +2.00%","Posted Plus","Yes","Declared","BFS Documented","2 business related docs","Current","Min. 2yr same industry","N/A","No","No","Same Underwriting","Fixed 1yr to 5yr",15,15,"1st Mort.","Yes","Yes","Title Insurance","no","n/a","Yes","Always","No","On Qual.","Yes"," -","FCT Platinum","Few lenders fill this niche","see rate sheet","Yes"]
["B2B Bank","B2B Bank  ( BFS Stated UNDER 2 years )",null,{"$f":"VLOOKUP(A15,'[1]My Six'!$F$5:$G$34,2,FALSE)","v":0},"National",65,540,"\"A -\"",50000,500000,"10% None Gifted","to 90%","Purch, ReFi, ETO","O/O max 2 units, Second Home"," -"," -",45,50," -",35,"Term"," -","higher of 5yr Benchmark or Deal Rate +2.00%","Posted Plus","Yes","Declared","BFS Documented","2 business related docs","Current","n/a","2 years","No","No","Same Underwriting","Fixed 1yr to 5yr",15,15,"1st Mort.","Yes","Yes","Title Insurance","no","n/a","Yes","Always","No","On Qual.","Yes"," -","FCT Platinum","Few lenders fill this niche","see rate sheet","Yes"]
{"$rows_left_out":131}
{"sheet":"Calculator","index":3,"n_rows":42,"n_cols":13,"rows_kept":42,"cut":false,"hidden":true,"merged":[[41,0,41,9],[8,3,8,8],[2,1,2,8],[11,1,14,1],[30,1,31,1],[37,1,37,8],[38,1,38,8],[7,1,7,8],[32,1,32,2],[39,1,39,8],[1,3,1,5],[3,1,3,8],[6,1,6,2],[6,3,6,8],[4,1,4,8],[5,2,5,6],[1,6,1,8]]}
[]
[null,null,null,null,null,null,"Comparison\nCalculator"]
[null,"prepared by"]
[null,{"$f":"'[2]Your Data'!$D$8","v":"Enter \"My Info\" data"}]
[null,{"$f":"'[2]Your Data'!$D$14","v":"Enter \"My Info\" data"}]
[null,null,{"$f":"\"provincial license / registration number \"&'[2]Your Data'!$D$19","v":"provincial license / registration number Enter \"My Info\" data"}]
[null,{"$f":"'[2]Your Data'!$D$9","v":"Enter \"My Info\" data"},null,{"$f":"'[2]Your Data'!$D$10","v":"Enter \"My Info\" data"}]
[]
[null,null,{"$f":"IF(ISBLANK(D9),\" \",\"Prepared expressly for:\")","v":" "}]
[]
[null,null,null,null,null,"Lender A",null,null,"Lender B"]
[null,null,"Net Loan Amount","a",null,null,null,null,{"$f":"F12","v":0}]
[null,null,"% \"Cash-Back\" given by Lender"]
[null,null,"Cash dollar amount",null,null,{"$f":"F12*F13","v":0},null,null,{"$f":"I13*F12","v":0}]
[null,null,"Funds \"Received\"",null,null,{"$f":"F12+F14","v":0},null,null,{"$f":"I12+I14","v":0}]
{"$rows_left_out":28}
{"sheet":"Printable","index":4,"n_rows":45,"n_cols":11,"rows_kept":45,"cut":false,"hidden":true,"merged":[[3,1,3,8],[6,1,6,2],[6,3,6,8],[1,3,1,8],[2,1,2,8],[4,1,4,8],[5,2,5,5],[41,1,41,9],[42,1,42,9],[44,1,44,9],[7,1,7,8],[11,1,14,1],[30,1,31,1],[8,3,8,8],[43,1,43,9],[36,1,36,9],[37,1,37,9],[38,1,38,9],[39,1,39,9],[40,1,40,9]]}
[]
[null,null,null,"Comparison\nCalculator"]
[null,{"$f":"Calculator!B3","v":"prepared by"}]
[null,{"$f":"Calculator!B4","v":"Enter \"My Info\" data"}]
[null,{"$f":"Calculator!B5","v":"Enter \"My Info\" data"}]
[null,null,{"$f":"Calculator!C6","v":"provincial license / registration number Enter \"My Info\" data"}]
[null,{"$f":"Calculator!B7","v":"Enter \"My Info\" data"},null,{"$f":"Calculator!D7","v":"Enter \"My Info\" data"}]
[]
[null,null,{"$f":"Calculator!C9","v":" "},{"$f":"Calculator!D9","v":0}]
[]
[null,null,null,null,null,{"$f":"Calculator!F11","v":"Lender A"},null,null,{"$f":"Calculator!I11","v":"Lender B"}]
[null,null,{"$f":"Calculator!C12","v":"Net Loan Amount"},"a",null,{"$f":"Calculator!F12","v":0},null,null,{"$f":"Calculator!I12","v":0}]
[null,null,{"$f":"Calculator!C13","v":"% \"Cash-Back\" given by Lender"},null,null,{"$f":"Calculator!F13","v":0},null,null,{"$f":"Calculator!I13","v":0}]
[null,null,{"$f":"Calculator!C14","v":"Cash dollar amount"},null,null,{"$f":"Calculator!F14","v":0},null,null,{"$f":"Calculator!I14","v":0}]
[null,null,{"$f":"Calculator!C15","v":"Funds \"Received\""},null,null,{"$f":"Calculator!F15","v":0},null,null,{"$f":"Calculator!I15","v":0}]
{"$rows_left_out":31}
{"sheet":"FieldFinder","index":5,"n_rows":56,"n_cols":3,"rows_kept":56,"cut":false,"hidden":true,"merged":[[1,0,1,9],[3,0,3,1],[4,1,4,2],[6,2,6,7]]}
[]
["This sheet is the source sheet name where the column headings are for the field search"]
[]
["Column A contains column Heading to display"]
[null,"Column B contains the heading sheet&cell address "]
["Title to Display","Reference Cell"]
["Column Finder - click here",{"$f":"Comparison!D7","v":0},"<<<  #N/A is a CORRECT display here "]
["Amortization Conventional",{"$f":"Comparison!$S$4","v":"Amortization"}]
["Amortization High Ratio",{"$f":"Comparison!$S$4","v":"Amortization"}]
["Amortization Minimum",{"$f":"Comparison!$S$4","v":"Amortization"}]
["Annual Prepayment",{"$f":"Comparison!$AJ$4","v":"Annual"}]
["Application Fee added?",{"$f":"Comparison!$AN$4","v":"Appl. Fee added?"}]
["Application Fees",{"$f":"Comparison!$AM$4","v":"Application Fees"}]
["Appraisal",{"$f":"Comparison!$AR$4","v":"Appraisal"}]
["Assumable",{"$f":"Comparison!$AU$4","v":"Assumable"}]
{"$rows_left_out":42}
{"sheet":"Agreement","index":6,"n_rows":47,"n_cols":2,"rows_kept":47,"cut":false,"hidden":true,"merged":[]}
[]
[null,"Mortgage Mentor: Disclaimer, Privacy Policy, and License Agreement"]
[]
[null,"Read the terms and conditions of this license agreement carefully.  "]
[null,"By: downloading, otherwise receiving, or using a copy of the program, you are accepting and agreeing to the terms of this license agreement."]
[]
[null,"1.     The program is copyrighted and licensed (not sold). This is a legal agreement between you (either an individual end-user or an entity) and MMI Mortgage Mentor Inc. (“MMI”) . If you do not agree to the terms and conditions of this agreement, you must promptly stop using the Software, remove it from any computer on which you have installed it, and destroy all aspects of the Software in your possession or control."]
[null,"continued…"]
[null,"2.      At MMI, we are committed to respecting and protecting your privacy and security.  We have taken measures to protect the security of your personal information and protect your data from misuse and unauthorized access or disclosure. While any data transmissions over the internet cannot be guaranteed 100%, MMI would like to reassure our subscribers that our site www.mortgagementor.com is protected by COPYminder (www.copyminder.com). To further protect your security, we are providing each subscriber with a unique Product Key for their personal use only.  By using this software you agree that your Product Key shall not be shared, distributed or broadcast to any other parties."]
[null,"continued…"]
[null,"3.    Each Product Key and Mortgage Mentor Tool (from herein referred to as “Software”) are protected by COPYminder.  Periodically throughout the duration of your subscription, your Product Key and computer ID will need to be re-validated by COPYminder’s protection system. To facilitate this, your computer will need to be connected to the internet.  No data is copied, installed, or accessed from your computer during this process. You agree to allow COPYminder access to the Software installed on your computer solely for such re-validation purposes."]
[null,"continued…"]
[null,"4.     The Software that is made available for downloading from our online server is owned by MMI.  This Software is protected by copyright laws, and is  licensed to you on a non-exclusive limited basis to be used by you in accordance with the terms and conditions described herein.  Any use, reproduction or redistribution of the Software that is not in accordance with the terms and conditions in this agreement is expressly prohibited by law, and may result in civil and criminal penalties."]
[null,"continued…"]
[null,"5.     This Software is licensed, not sold, for use under the terms and conditions of this agreement, and MMI reserves all rights not expressly granted in this agreement. Without limiting the generality of the forgoing MMI retains ownership of  the Software, and all intellectual property rights therein.  As such, you acknowledge and agree that MMI holds all rights to title and interest in all tangible and intangible incidents of the product and/or service, including copyrights and trade secrets pertaining thereto, and that this agreement conveys to you only a limited right to access and use of the product and/or service.  Subject to the terms and conditions of this agreement, MMI grants to you a non-exclusive limited license to use one copy of the Software and any documentation accompanying this agreement on one computer only.  No other rights are granted.  You may not use the Software on different computers concurrently using the same Product Key.  Attempts to install this Software on a second computer will cause the original, authorized installation to malfunction."]
{"$rows_left_out":32}