{"text_format":"1","workbook":"xlsx","n_sheets":5,"sheets":["Veil","Introduction","VRM & ARM","Agreement","FieldFinder"],"not_rendered":{"charts":0,"images":4,"macros":1,"external_links":1,"defined_names":6,"comments":2,"pivot_tables":0},"unopened":[],"bounds":{"document_bytes":16777216,"sheet_cells":100000,"rows_first":2000,"rows_last":500,"rows_between":2000,"halvings":0,"cell_chars":16384,"cell_head_chars":4096},"cells_cut":0,"cells_raw":0,"read":"whole","date_system":"1900"}

{"sheet":"Veil","index":0,"n_rows":22,"n_cols":3,"rows_kept":22,"cut":false,"hidden":false,"merged":[]}
[]
[]
[]
[null,null," Copy Protection Test in Progress"]
[]
[null,null,"This sheet should appear temporarily while your computer runs"]
[null,null,"a brief test of a third party copy protection system."]
[]
[]
[null,null,"If this sheet remains on your screen for more that a 30 seconds,"]
[null,null,"one of three known conditions likely exists."]
[]
[]
[null,null,"1. an internet connection is not available"]
[]
[null,null,"2.  this copy is not registered for this computer."]
[null,null,"You can obtain subscription info by contacting"]
[null,null,"www.mortgagementor.com/contact-us"]
[]
[null,null,"3. you are registering a new Mortgage Mentor installation on a MAC"]
{"$rows_left_out":3}
{"sheet":"Introduction","index":1,"n_rows":30,"n_cols":5,"rows_kept":30,"cut":false,"hidden":true,"merged":[[2,1,2,5],[17,3,17,4],[6,2,6,3],[14,3,14,4],[15,3,15,4],[9,3,9,4],[22,1,23,5],[27,1,27,4],[4,3,4,4],[7,3,7,4],[11,3,11,4],[12,3,12,4]]}
[]
[]
[null,"This tool is best used as an active spreadsheet using Microsoft Excel."]
[null,null,null,null,"Please read the attached \"Agreement\" before using this tool"]
[]
[]
[null,null,"Comparison Tab"]
[null,null,null,"This comparison table has \"locked\" titles on both the top and left side.  This enables you to scroll throughout the spreadsheet without losing your reference titles."]
[]
[null,null,null,"Cells shaded like this one, indicate there are footnotes for this feature.  To automatically see the footnote on-screen, simply place your mouse pointer over that cell.  Try it here."]
[]
[null,null,null,"Products may be \"Filtered\" or short-listed to help you select the options that apply to your client."]
[null,null,null,"By criterion - to see the short list of the products that fit your clients: LTV, Beacon, income source, etc. simply click on the down arrow in the applicable title cell.  A drop down list of all the options  listed will appear.  Within that new drop-down list, click on the data that most closely fits your clients circumstances and a \"short-list\" of the matching lenders will be left for your review.  You can \"Filter\" on more than one title at a time.  For more details on using the the filter tool contact your RSM."]
[]
[null,null,null,"a \"-\" in a Cell/Box indicates that we have asked for the information and there is none that applies. "]
[null,null,null,"a blank Cell/Box or one marked \"Under Advisement\" indicates that the lender has not provided a definite answer yet."]
[]
[null,null,null,"With the exception of Home Trust and Van City, regional lenders have not been included in this tool.  If you have regional lenders in your market area, please forward the email address for their representative and we will add their information to a future"]
[]
[]
{"$rows_left_out":11}
{"sheet":"VRM & ARM","index":2,"n_rows":123,"n_cols":47,"rows_kept":123,"cut":false,"hidden":true,"merged":[[15,1,15,2],[16,1,16,2],[17,1,17,2],[8,1,8,2],[9,1,9,2],[22,1,22,2],[31,1,31,2],[60,1,60,2],[61,1,61,2],[59,1,59,2],[49,1,49,2],[28,1,28,2],[34,1,34,2],[35,1,35,2],[36,1,36,2],[37,1,37,2],[38,1,38,2],[29,1,29,2],[13,1,13,2],[50,1,50,2],[51,1,51,2],[52,1,52,2],[53,1,53,2],[54,1,54,2],[62,1,62,2],[111,1,111,2],[102,1,102,2],[78,1,78,2],[75,1,75,2],[71,1,71,2],[72,1,72,2],[73,1,73,2],[74,1,74,2],[76,1,76,2],[77,1,77,2],[94,1,94,2],[95,1,95,2],[96,1,96,2],[97,1,97,2],[98,1,98,2],[99,1,99,2],[91,1,91,2],[103,1,103,2],[110,1,110,2],[79,1,79,2],[80,1,80,2],[81,1,81,2],[82,1,82,2],[112,1,112,2],[89,1,89,2],[100,1,100,2],[84,1,84,2],[85,1,85,2],[86,1,86,2],[87,1,87,2],[88,1,88,2],[105,1,105,2],[109,1,109,2],[106,1,106,2],[107,1,107,2],[108,1,108,2],[104,1,104,2],[83,1,83,2],[90,1,90,2],[92,1,92,2],[93,1,93,2],[101,1,101,2],[11,1,11,2],[10,1,10,2],[12,1,12,2],[70,1,70,2],[20,1,20,2],[21,1,21,2],[47,1,47,2],[32,1,32,2],[14,1,14,2],[65,1,65,2],[66,1,66,2],[67,1,67,2],[68,1,68,2],[63,1,63,2],[64,1,64,2],[55,1,55,2],[56,1,56,2],[57,1,57,2],[58,1,58,2],[3,10,4,10],[3,42,4,42],[3,39,4,39],[3,37,4,37],[3,40,4,40],[3,38,4,38],[3,36,4,36],[3,12,3,13],[115,31,115,41],[3,24,4,24],[3,19,3,20],[3,14,3,15],[3,22,4,22],[3,21,4,21],[3,23,4,23],[3,16,3,18],[122,31,122,35],[117,31,117,34],[118,31,118,34],[120,31,120,34],[119,31,119,34],[3,25,4,25],[3,43,4,43],[3,11,4,11],[69,1,69,2],[30,1,30,2],[1,1,4,2],[7,1,7,2],[18,1,18,2],[19,1,19,2],[120,1,120,5],[3,5,4,5],[3,6,4,6],[115,1,115,10],[6,1,6,2],[23,1,23,2],[24,1,24,2],[25,1,25,2],[26,1,26,2],[27,1,27,2],[3,46,4,46],[3,44,4,44],[3,32,4,32],[3,35,4,35],[3,45,4,45],[0,10,0,46],[2,31,2,36],[1,3,1,9],[1,10,1,47],[2,37,2,44],[2,19,2,20],[2,12,2,18],[2,26,2,30],[3,26,4,26],[3,27,4,27],[3,33,4,33],[3,34,4,34],[3,28,4,28],[3,29,4,29],[3,31,4,31],[3,30,4,30],[3,8,3,9],[3,7,4,7],[3,4,4,4],[48,1,48,2],[33,1,33,2],[44,1,44,2],[45,1,45,2],[46,1,46,2],[39,1,39,2],[40,1,40,2],[41,1,41,2],[42,1,42,2],[43,1,43,2]]}
[]
[null,"\"Building the best Broker tools\nsince the fax machine!\"\nnot updated after 05/31/2018",null,"© printing or copying this page or any portion of this page, in any way, without prior written permission of the author is prohibited ",null,null,null,null,null,null,{"$f":"REPT(\"Armand by MORTGAGE MENTOR     : : :    \",15)","v":"Armand by MORTGAGE MENTOR     : : :    Armand by MORTGAGE MENTOR     : : :    Armand by MORTGAGE MENTOR     : : :    Armand by MORTGAGE MENTOR     : : :    Armand by MORTGAGE MENTOR     : : :    Armand by MORTGAGE MENTOR     : : :    Armand by MORTGAGE MENTOR     : : :    Armand by MORTGAGE MENTOR     : : :    Armand by MORTGAGE MENTOR     : : :    Armand by MORTGAGE MENTOR     : : :    Armand by MORTGAGE MENTOR     : : :    Armand by MORTGAGE MENTOR     : : :    Armand by MORTGAGE MENTOR     : : :    Armand by MORTGAGE MENTOR     : : :    Armand by MORTGAGE MENTOR     : : :    "}]
[null,null,null,null,"PRODUCT SELECTION - Variable Rate",null,null,null,null,null,"( Fixed Rate )","( Debt Consolidation )","DEBT SERVICING",null,null,null,null,null,null,"RATE",null,null,null,null,null,null,"PAYMENT",null,null,null,null,"CLIENT OPTIONS",null,null,null,null,null,"GENERAL"]
[null,null,null,null,"Lending Area","LTV (%) Maximum","Beacon Minimum","Term (Yrs)","Loan Amount",null,"Purpose","Property Type","Insurable",null,"Un-Insurable",null,"Amortization",null,null,"Qualifying Rate",null,"Basic Rate","Compounding","Rate Cap","Rate Hold \nPeriod","Cash-Back","Initial Pmt. Based On","Ongoing Pmt. Based On","Payment Amount","Rate- Renewed","Payment Options","Convertible to a fixed term","Conversion Rate","Annual Prepayment (%)","Payment Increase Option (%)","Payout Interest Penalty","Fully Open After","Appraisal","Title Insurance","New to Canada","Portable","Assumable","Switch-In","Refinance","Finders Fee (bps)","Trailer Fees","Volume Bonus"]
[null,null,null,null,null,null,null,null,"Minimum","Maximum",null,null,"GDS %","TDS %","GDS %","TDS %","Insurable","Un-Insurable","Minimum","Insurable","Un-Insurable"]
[null,"Column Finder - click here."]
["B2B Bank","B2B Bank    ( Equity 50 )",null,{"$f":"VLOOKUP(A7,'[1]My Six'!$F$5:$G$34,2,FALSE)","v":0},"National",50,660,"3 or 5",50000,400000,"Purch, ReFi, ETO","O/O to 2 units"," -"," -"," -"," -"," -","30 / 35","Term"," -","higher of 5yr Benchmark or Deal Rate +2.00%","see lender's \nsheet or email","Semi-annual","No","Spread 120 days","no","3 yr post.","\"Choice\"","\"Choice\"","With Prime","w,bw,m","Rem. of Term\n or longer","Best",15,15,"3 mo.","Term","Lender List","Always","No","Yes","On Qual","Yes","FCT Platinum","per Term","No","Yes"]
["B2B Bank","B2B Bank    ( Equity 65 )",null,{"$f":"VLOOKUP(A8,'[1]My Six'!$F$5:$G$34,2,FALSE)","v":0},"National",65,660,"3 or 5",50000,400000,"Purch, ReFi, ETO","O/O to 2 units"," -"," -"," -","50/65"," -","30 / 35","Term"," -","higher of 5yr Benchmark or Deal Rate +2.00%","see lender's \nsheet or email","Semi-annual","No","Spread 120 days","no","3 yr post.","\"Choice\"","\"Choice\"","With Prime","w,bw,m","Rem. of Term\n or longer","Best",15,15,"3 mo.","Term","Lender List","Always","No","Yes","On Qual","Yes","FCT Platinum","per Term","No","Yes"]
["B2B Bank","B2B Bank    ( 3 yr Variable )",null,{"$f":"VLOOKUP(A9,'[1]My Six'!$F$5:$G$34,2,FALSE)","v":0},"National",95,600,3,75000,"$1,250,000 $2,000,000","Purch, ReFi, ETO,\n Purch & ReFi + Improv.","O/O to 4 units (Insured), to 2 units (Conventional), Second Home",39,44,"35/39","42/44",25,35,"Term","BoC Benchmark","higher of 5yr Benchmark or Deal Rate +2.00%","see lender's \nsheet or email","Semi-annual","No","Spread 120 days","no","3 yr post.","\"Choice\"","\"Choice\"","With Prime","w,bw,m","Rem. of 3yr\n or longer","Best",15,15,"3 mo.","3yr","Lender List","Always","No","Yes","On Qual","Yes","FCT Platinum",50,"No","Yes"]
["B2B Bank","B2B Bank    ( 5 yr Variable Un-Insurable)",null,{"$f":"VLOOKUP(A10,'[1]My Six'!$F$5:$G$34,2,FALSE)","v":0},"National",80,600,5,75000,"$750,000 $2,000,000","Purch, ReFi, ETO,\n Purch & ReFi + Improv.","O/O to 2 units"," -"," -","35/39","42/44"," -",35,"Term"," -","higher of 5yr Benchmark or Deal Rate +2.00%","see lender's \nsheet or email","Semi-annual","No","Spread 120 days","no","3 yr post.","\"Choice\"","\"Choice\"","With Prime","w,bw,m","Rem. of 5yr\n or longer","Best",15,15,"3 mo.","5yr","Lender List","Always","No","Yes","On Qual","Yes","FCT Platinum",90,"No","Yes"]
["B2B Bank","B2B Bank    ( 5 yr Variable Insurable)",null,{"$f":"VLOOKUP(A11,'[1]My Six'!$F$5:$G$34,2,FALSE)","v":0},"National",95,600,5,75000,"$925,000 \nplus ins.","Purch, Purch + Improv.","O/O to 4 units (Insured), \nSecond Home",39,44," -"," -",25," -","Term","BoC Benchmark"," -","see lender's \nsheet or email","Semi-annual","No","Spread 120 days","no","3 yr post.","\"Choice\"","\"Choice\"","With Prime","w,bw,m","Rem. of 5yr\n or longer","Best",15,15,"3 mo.","5yr","Lender List","Always","No","Yes","On Qual","Yes","FCT Platinum",90,"No","Yes"]
["B2B Bank","B2B Bank     ( \"BFS Stated\" Variable )",null,{"$f":"VLOOKUP(A12,'[1]My Six'!$F$5:$G$34,2,FALSE)","v":0},"National",90,600,5,75000,750000,"Purch, ReFi, ETO,\n Purch & ReFi + Improv.","O/O to 2 units",39,44,"35/39","42/44",25,35,"Term"," -","higher of 5yr Benchmark or Deal Rate +2.00%","see lender's \nsheet or email","Semi-annual","No","Spread 120 days","no","3 yr post.","\"Choice\"","\"Choice\"","With Prime","w,bw,m","Rem. of 5yr\n or longer","Best",15,15,"3 mo.","5yr","Lender List","Always","No","Yes","On Qual","No","FCT Platinum",70,"No","Yes"]
["B2B Bank","B2B Bank    ( Homeowners Kit 3yr )",null,{"$f":"VLOOKUP(A13,'[1]My Six'!$F$5:$G$34,2,FALSE)","v":0},"National",80,650,3,75000,750000,"Purch, ReFi, ETO,\n Purch & ReFi + Improv.","O/O to 2 units"," -"," -",32,40," -",35,"Term"," -","higher of 5yr Benchmark or Deal Rate +2.00%","see lender's \nsheet or email","Semi-annual","No","Spread 120 days","no","3 yr post.","\"Choice\"","\"Choice\"","With Prime","w,bw,m","Rem. of Term\n or longer","Best",15,15,"3 mo.","3yr","Lender List","Always","No","Yes","On Qual","Yes","FCT Platinum",50,"No","Yes"]
["B2B Bank","B2B Bank    ( Homeowners Kit 5yr )",null,{"$f":"VLOOKUP(A14,'[1]My Six'!$F$5:$G$34,2,FALSE)","v":0},"National",80,650,5,75000,750000,"Purch, ReFi, ETO,\n Purch & ReFi + Improv.","O/O to 2 units"," -"," -",32,40," -",35,"Term"," -","higher of 5yr Benchmark or Deal Rate +2.00%","see lender's \nsheet or email","Semi-annual","No","Spread 120 days","no","3 yr post.","\"Choice\"","\"Choice\"","With Prime","w,bw,m","Rem. of Term\n or longer","Best",15,15,"3 mo.","5yr","Lender List","Always","No","Yes","On Qual","Yes","FCT Platinum",50,"No","Yes"]
["Canadiana Financial","Canadiana      ( 5yr Insurable )",null,{"$f":"VLOOKUP(A15,'[1]My Six'!$F$5:$G$34,2,FALSE)","v":0},"Provinces exc. PQ",95,"620 / 660",5,75000,"$925,000 \nplus ins.","Purch, Plus Improv.","O/O to 4 units, Second Home","35/39","42/44"," -"," -",25," -","18 / 15","BoC Benchmark"," -","see lender's \nsheet or email","Semi-annual","No","Spread 90 days","no","Deal Rate","Prime & Adjustment","Changes","1st of Mo. foll. BoC","w,bw,sm,m","Rem. of 5yr","Disc.",20,"20\nMatch & Miss","3 mo.","5yr","any NAS/Solidifi approved","Req'd\n FCT","Yes","Yes","On Qual","Yes","Yes","95+ see \nrate sheet","Yes","Yes"]
["Canadiana Financial","Canadiana      ( 5yr Low Feature HR )",null,{"$f":"VLOOKUP(A16,'[1]My Six'!$F$5:$G$34,2,FALSE)","v":0},"Provinces exc. PQ",95,640,5,75000,"$925,000 \nplus ins.","Purch, Plus Improv.","O/O to 2 units","35/39","42/44"," -"," -",25," -","18 / 15","BoC Benchmark"," -","see lender's \nsheet or email","Semi-annual","No","Spread 90 days","no","Deal Rate","Prime & Adjustment","Changes","1st of Mo. foll. BoC","w,bw,sm,m","5yr SpendLESS","Disc.",20,"20\nMatch & Miss","Higher 3 mo.\n or 2.75%","5yr","any NAS/Solidifi approved","Req'd\n FCT","Yes","Yes","On Qual","Yes","Yes","95+ see \nrate sheet","Yes","Yes"]
["Canadiana Financial","Canadiana      ( 5yr Low Feature Conv )",null,{"$f":"VLOOKUP(A17,'[1]My Six'!$F$5:$G$34,2,FALSE)","v":0},"Provinces exc. PQ",80,680,5,75000,799999,"Purch, Plus Improv.","O/O to 2 units"," -"," -","35/39","42/44"," -","25 / 30","18 / 15"," -","higher of 5yr Benchmark or Deal Rate +2.00%","see lender's \nsheet or email","Semi-annual","No","Spread 90 days","no","Deal Rate","Prime & Adjustment","Changes","1st of Mo. foll. BoC","w,bw,sm,m","5yr SpendLESS","Disc.",20,"20\nMatch & Miss","Higher 3 mo.\n or 2.75%","5yr","any NAS/Solidifi approved","Req'd\n FCT","Yes","Yes","On Qual","Yes","Yes","95+ see \nrate sheet","Yes","Yes"]
["Canadiana Financial","Canadiana      ( 5yr Conventional )",null,{"$f":"VLOOKUP(A18,'[1]My Six'!$F$5:$G$34,2,FALSE)","v":0},"Provinces exc. PQ",80,650,5,100000,"$1,000,000+","Purch, Plus Improv., \nRefi, Refi Plus Improv, ETO","O/O to 4 units, Second Home, \nSmall Rentals"," -"," -"," -"," -"," -",30,"18 / 15"," -"," -","see lender's \nsheet or email","Semi-annual","No","Spread 60 days","no","Deal Rate","Prime & Adjustment","Changes","1st of Mo. foll. BoC","w,bw,sm,m","Rem. of 5yr","Disc.",20,"20\nMatch & Miss","3 mo.","5yr","any NAS/Solidifi approved","Req'd\n FCT","No","Yes","On Qual","Yes","Yes","105+10+5","Yes","Yes"]
["Canadiana Financial","Canadiana      ( 3 year to Nov 2020 )",null,{"$f":"VLOOKUP(A19,'[1]My Six'!$F$5:$G$34,2,FALSE)","v":0},"Provinces exc. PQ",95,650,3,75000,"$925,000 \nplus ins.","Purch, Plus Improv.","O/O to 4 units","35/39","42/44"," -"," -",25," -","18 / 15","BoC Benchmark"," -","see lender's \nsheet or email","Semi-annual","No","Spread 120 days","no","Deal Rate","Prime & Adjustment","Changes","1st of Mo. foll. BoC","w,bw,sm,m","Rem. of 5yr","Disc.",20,"20\nMatch & Miss","3 mo.","5yr","any NAS/Solidifi approved","Req'd\n FCT","Yes","Yes","On Qual","Yes","Yes","80+ see \nrate sheet","Yes","Yes"]
["Canadiana Financial","Canadiana      ( 5yr Blue Box Special )\n                         general guidelines",null,{"$f":"VLOOKUP(A20,'[1]My Six'!$F$5:$G$34,2,FALSE)","v":0},"Provinces exc. PQ",95,680,5,75000,"$925,000 \nplus ins.","Purch,\n(Switch by exception)","O/O to 2 units","35/39","42/44"," -"," -",25," -","18 / 15","BoC Benchmark"," -","see lender's \nsheet or email","Semi-annual","No","Spread 120 days","no","Deal Rate","Prime & Adjustment","Changes","1st of Mo. foll. BoC","w,bw,sm,m","Rem. of 5yr","Disc.",20,"20\nMatch & Miss","3 mo.","5yr","any NAS/Solidifi approved","Req'd\n FCT","No","Yes","On Qual","Yes","Yes","95+ see \nrate sheet","Yes","Yes"]
{"$rows_left_out":104}
{"sheet":"Agreement","index":3,"n_rows":47,"n_cols":2,"rows_kept":47,"cut":false,"hidden":true,"merged":[]}
[]
[null,"Mortgage Mentor: Disclaimer, Privacy Policy, and License Agreement"]
[]
[null,"Read the terms and conditions of this license agreement carefully.  "]
[null,"By: downloading, otherwise receiving, or using a copy of the program, you are accepting and agreeing to the terms of this license agreement."]
[null,"continued…"]
[null,"1.     The program is copyrighted and licensed (not sold). This is a legal agreement between you (either an individual end-user or an entity) and MMI Mortgage Mentor Inc. (“MMI”) . If you do not agree to the terms and conditions of this agreement, you must promptly stop using the Software, remove it from any computer on which you have installed it, and destroy all aspects of the Software in your possession or control."]
[null,"continued…"]
[null,"2.      At MMI, we are committed to respecting and protecting your privacy and security.  We have taken measures to protect the security of your personal information and protect your data from misuse and unauthorized access or disclosure. While any data transmissions over the internet cannot be guaranteed 100%, MMI would like to reassure our subscribers that our site www.mortgagementor.com is protected by CopyMinder (www.copyminder.com). To further protect your security, we are providing each subscriber with a unique Product Key for their personal use only.  By using this software you agree that your Product Key shall not be shared, distributed or broadcast to any other parties."]
[null,"continued…"]
[null,"3.    Each Product Key and Mortgage Mentor Tool (from herein referred to as “Software”) are protected by CopyMinder.  Periodically throughout the duration of your subscription, your Product Key and computer ID will need to be re-validated by COPY minder's protection system. To facilitate this, your computer will need to be connected to the internet.  No data is copied, installed, or accessed from your computer during this process. You agree to allow CopyMinder access to the Software installed on your computer solely for such re-validation purposes."]
[null,"continued…"]
[null,"4.     The Software that is made available for downloading from our online server is owned by MMI.  This Software is protected by copyright laws, and is  licensed to you on a non-exclusive limited basis to be used by you in accordance with the terms and conditions described herein.  Any use, reproduction or redistribution of the Software that is not in accordance with the terms and conditions in this agreement is expressly prohibited by law, and may result in civil and criminal penalties."]
[null,"continued…"]
[null,"5.     This Software is licensed, not sold, for use under the terms and conditions of this agreement, and MMI reserves all rights not expressly granted in this agreement. Without limiting the generality of the forgoing MMI retains ownership of  the Software, and all intellectual property rights therein.  As such, you acknowledge and agree that MMI holds all rights to title and interest in all tangible and intangible incidents of the product and/or service, including copyrights and trade secrets pertaining thereto, and that this agreement conveys to you only a limited right to access and use of the product and/or service.  Subject to the terms and conditions of this agreement, MMI grants to you a non-exclusive limited license to use one copy of the Software and any documentation accompanying this agreement on one computer only.  No other rights are granted.  You may not use the Software on different computers concurrently using the same Product Key.  Attempts to install this Software on a second computer will cause the original, authorized installation to malfunction."]
[null,"continued…"]
[null,"6.      The Software contains copyrighted concepts, ideas, and other proprietary materials of MMI. You agree not to analyze, reverse engineer, decompile or disassemble the Software, or any part of the Software.  You also agree to not modify or create derivative works of the Software, combine with or incorporate the Software into any other application Software, print a copy of the Software, reproduce, distribute, publish, resell for profit, broadcast, transmit or provide its functionality, or commercially exploit the Software and any information available on this site in any matter without the express consent of MMI. AND IS PROHIBITED WITHOUT THE EXPRESS WRITTEN PERMISSION OF MMI."]
[null,"continued…"]
[null,"7.      The Software is considered in use if it is loaded on the computer’s permanent or temporary memory.  If you are acquiring the Software on behalf of another person or entity, you represent and warrant that you have the authority to bind the party or entity for which you are acquiring the Software to the terms and conditions of this agreement."]
[null,"continued…"]
{"$rows_left_out":28}
{"sheet":"FieldFinder","index":4,"n_rows":40,"n_cols":3,"rows_kept":40,"cut":false,"hidden":true,"merged":[[1,0,1,9],[3,0,3,1],[4,1,4,2],[7,2,7,5]]}
[]
["This sheet is the source sheet name where the column headings are for the field search"]
[]
["Column A contains column Heading to display"]
[null,"Column B contains the heading sheet&cell address "]
[]
["Title to Display","Reference Cell"]
["Column Finder - click here",{"$f":"'VRM & ARM'!D7","v":0},"<<< \"0\" or #N/A are acceptable displays here"]
["Amortization",{"$f":"'VRM & ARM'!Q4","v":"Amortization"}]
["Annual Prepayment",{"$f":"'VRM & ARM'!AH4","v":"Annual Prepayment (%)"}]
["Appraisal details",{"$f":"'VRM & ARM'!AL4","v":"Appraisal"}]
["Assumability",{"$f":"'VRM & ARM'!AP4","v":"Assumable"}]
["Avail for New To Canada",{"$f":"'VRM & ARM'!AN4","v":"New to Canada"}]
["Beacon",{"$f":"'VRM & ARM'!G4","v":"Beacon Minimum"}]
["Cash Back",{"$f":"'VRM & ARM'!Z4","v":"Cash-Back"}]
["Compounding",{"$f":"'VRM & ARM'!W4","v":"Compounding"}]
["Conversion Rate",{"$f":"'VRM & ARM'!AG4","v":"Conversion Rate"}]
["Convertible to?",{"$f":"'VRM & ARM'!AF4","v":"Convertible to a fixed term"}]
["Debt Service Ratios",{"$f":"'VRM & ARM'!M4","v":"Insurable"}]
["Lending Area",{"$f":"'VRM & ARM'!E4","v":"Lending Area"}]
{"$rows_left_out":20}